{"text_format":"1","workbook":"xlsx","n_sheets":11,"sheets":["RFC (1)","RFC (2)","RFC (3)","RFC (4)","RFC (5)","RFC (6)","RFC (7)","RFC (8)","RFC (9)","RFC (10)","Factors"],"not_rendered":{"charts":0,"images":0,"macros":1,"external_links":0,"defined_names":21,"comments":0,"pivot_tables":0},"unopened":[],"bounds":{"document_bytes":16777216,"sheet_cells":100000,"rows_first":2000,"rows_last":500,"rows_between":2000,"halvings":0,"cell_chars":16384,"cell_head_chars":4096},"cells_cut":0,"cells_raw":0,"read":"whole","date_system":"1900"}

{"sheet":"RFC (1)","index":0,"n_rows":82,"n_cols":64,"rows_kept":82,"cut":false,"hidden":false,"merged":[[9,3,9,6],[81,55,81,59],[81,60,81,63],[79,1,79,9],[81,33,81,44],[81,45,81,54],[77,1,77,9],[78,1,78,9],[75,1,75,9],[76,1,76,9],[73,1,73,9],[74,1,74,9],[71,1,71,9],[72,1,72,9],[71,12,71,15],[72,12,72,15],[73,12,73,15],[74,12,74,15],[75,12,75,15],[66,1,66,9],[63,1,63,9],[64,1,64,9],[63,12,63,15],[64,12,64,15],[65,12,65,15],[66,12,66,15],[69,1,69,9],[70,1,70,9],[67,1,67,9],[68,1,68,9],[67,12,67,15],[68,12,68,15],[69,12,69,15],[70,12,70,15],[61,1,61,9],[62,1,62,9],[59,1,59,9],[60,1,60,9],[59,12,59,15],[60,12,60,15],[61,12,61,15],[62,12,62,15],[65,1,65,9],[53,55,53,59],[53,60,53,63],[54,1,54,9],[51,1,51,2],[54,12,54,15],[57,1,57,9],[58,1,58,9],[55,1,55,9],[56,1,56,9],[55,12,55,15],[56,12,56,15],[57,12,57,15],[58,12,58,15],[41,4,41,8],[36,1,36,15],[38,4,38,8],[38,12,38,13],[39,4,39,8],[40,4,40,8],[40,12,40,13],[53,33,53,44],[53,45,53,54],[30,2,30,8],[30,12,30,13],[34,4,34,8],[34,12,34,13],[18,2,18,4],[24,1,24,15],[26,12,26,13],[27,2,27,8],[27,12,27,13],[27,14,27,15],[43,8,43,11],[44,8,44,11],[43,4,43,7],[44,4,44,7],[43,1,43,3],[44,1,44,3],[3,2,3,6],[3,13,3,15],[5,8,5,15],[7,10,7,12],[7,13,7,15],[11,8,11,12],[8,3,8,6],[8,1,8,2],[9,1,9,2],[11,3,11,6],[10,13,10,15],[11,13,11,15],[12,2,12,6],[12,13,12,15],[8,10,8,12],[8,13,8,15],[9,8,9,12],[9,13,9,15],[80,12,80,15],[7,20,8,24],[5,19,6,25],[11,19,12,25],[13,19,13,25],[44,12,44,15],[77,12,77,15],[78,12,78,15],[79,12,79,15],[43,12,43,15],[28,12,28,13],[28,14,28,15],[76,12,76,15]]}
[null,"Mississippi Home Corporation"]
[null,"Request for Cash"]
[]
[null,"Program:","BLIGHT ELIMINATION PROGRAM",null,null,null,null,null,null,null,null,null,"Disbursement Type:"]
[]
[null,"Section A:  General Information",null,null,null,null,null,null,"Section B:  Project Information",null,null,null,null,null,null,null,null,null,null,"Instructions:"]
[]
[null,"  Recipient",null,null,null,null,null,null,"Program No.",null,"Property No.",null,null,"Blight Partner No.",null,null,null,null,null,1,"Complete the Cost Items section by entering the Cost Item Category and the amount to be reimbursed."]
{"$rows_left_out":75}
{"sheet":"RFC (2)","index":1,"n_rows":82,"n_cols":64,"rows_kept":82,"cut":false,"hidden":true,"merged":[[3,2,3,6],[3,13,3,15],[5,8,5,15],[5,19,6,25],[7,10,7,12],[7,13,7,15],[7,20,8,24],[8,1,8,2],[8,3,8,6],[8,10,8,12],[11,19,12,25],[12,2,12,6],[12,13,12,15],[13,19,13,25],[18,2,18,4],[24,1,24,15],[8,13,8,15],[9,1,9,2],[9,8,9,12],[9,13,9,15],[10,13,10,15],[11,3,11,6],[11,8,11,12],[11,13,11,15],[30,2,30,8],[30,12,30,13],[34,4,34,8],[34,12,34,13],[36,1,36,15],[38,4,38,8],[38,12,38,13],[26,12,26,13],[27,2,27,8],[27,12,27,13],[27,14,27,15],[28,12,28,13],[28,14,28,15],[44,1,44,3],[44,4,44,7],[44,8,44,11],[44,12,44,15],[51,1,51,2],[53,33,53,44],[39,4,39,8],[40,4,40,8],[40,12,40,13],[41,4,41,8],[43,1,43,3],[43,4,43,7],[43,8,43,11],[43,12,43,15],[56,1,56,9],[56,12,56,15],[57,1,57,9],[57,12,57,15],[58,1,58,9],[58,12,58,15],[53,45,53,54],[53,55,53,59],[53,60,53,63],[54,1,54,9],[54,12,54,15],[55,1,55,9],[55,12,55,15],[62,1,62,9],[62,12,62,15],[63,1,63,9],[63,12,63,15],[64,1,64,9],[64,12,64,15],[59,1,59,9],[59,12,59,15],[60,1,60,9],[60,12,60,15],[61,1,61,9],[61,12,61,15],[68,1,68,9],[68,12,68,15],[69,1,69,9],[69,12,69,15],[70,1,70,9],[70,12,70,15],[65,1,65,9],[65,12,65,15],[66,1,66,9],[66,12,66,15],[67,1,67,9],[67,12,67,15],[74,1,74,9],[74,12,74,15],[75,1,75,9],[75,12,75,15],[76,1,76,9],[76,12,76,15],[71,1,71,9],[71,12,71,15],[72,1,72,9],[72,12,72,15],[73,1,73,9],[73,12,73,15],[80,12,80,15],[81,33,81,44],[81,45,81,54],[81,55,81,59],[81,60,81,63],[77,1,77,9],[77,12,77,15],[78,1,78,9],[78,12,78,15],[79,1,79,9],[79,12,79,15]]}
[null,"Mississippi Home Corporation"]
[null,"Request for Cash"]
[]
[null,"Program:","BLIGHT ELIMINATION PROGRAM",null,null,null,null,null,null,null,null,null,"Disbursement Type:","HHF Disbursement"]
[]
[null,"Section A:  General Information",null,null,null,null,null,null,"Section B:  Project Information",null,null,null,null,null,null,null,null,null,null,"Instructions:"]
[]
[null,"  Recipient",null,{"$f":"VLOOKUP('RFC (1)'!$D$8,Factors!I4:J7,2)","v":{"$error":"#N/A"}},null,null,null,null,"Program No.",null,"Property No.",null,null,"Blight Partner No.",null,null,null,null,null,1,"Complete the Cost Items section by entering the Cost Item Category and the amount to be reimbursed."]
{"$rows_left_out":75}
{"sheet":"RFC (3)","index":2,"n_rows":82,"n_cols":64,"rows_kept":82,"cut":false,"hidden":true,"merged":[[3,2,3,6],[3,13,3,15],[5,8,5,15],[5,19,6,25],[7,10,7,12],[7,13,7,15],[7,20,8,24],[8,1,8,2],[8,3,8,6],[8,10,8,12],[11,19,12,25],[12,2,12,6],[12,13,12,15],[13,19,13,25],[18,2,18,4],[24,1,24,15],[8,13,8,15],[9,1,9,2],[9,8,9,12],[9,13,9,15],[10,13,10,15],[11,3,11,6],[11,8,11,12],[11,13,11,15],[30,2,30,8],[30,12,30,13],[34,4,34,8],[34,12,34,13],[36,1,36,15],[38,4,38,8],[38,12,38,13],[26,12,26,13],[27,2,27,8],[27,12,27,13],[27,14,27,15],[28,12,28,13],[28,14,28,15],[44,1,44,3],[44,4,44,7],[44,8,44,11],[44,12,44,15],[51,1,51,2],[53,33,53,44],[39,4,39,8],[40,4,40,8],[40,12,40,13],[41,4,41,8],[43,1,43,3],[43,4,43,7],[43,8,43,11],[43,12,43,15],[56,1,56,9],[56,12,56,15],[57,1,57,9],[57,12,57,15],[58,1,58,9],[58,12,58,15],[53,45,53,54],[53,55,53,59],[53,60,53,63],[54,1,54,9],[54,12,54,15],[55,1,55,9],[55,12,55,15],[62,1,62,9],[62,12,62,15],[63,1,63,9],[63,12,63,15],[64,1,64,9],[64,12,64,15],[59,1,59,9],[59,12,59,15],[60,1,60,9],[60,12,60,15],[61,1,61,9],[61,12,61,15],[68,1,68,9],[68,12,68,15],[69,1,69,9],[69,12,69,15],[70,1,70,9],[70,12,70,15],[65,1,65,9],[65,12,65,15],[66,1,66,9],[66,12,66,15],[67,1,67,9],[67,12,67,15],[74,1,74,9],[74,12,74,15],[75,1,75,9],[75,12,75,15],[76,1,76,9],[76,12,76,15],[71,1,71,9],[71,12,71,15],[72,1,72,9],[72,12,72,15],[73,1,73,9],[73,12,73,15],[80,12,80,15],[81,33,81,44],[81,45,81,54],[81,55,81,59],[81,60,81,63],[77,1,77,9],[77,12,77,15],[78,1,78,9],[78,12,78,15],[79,1,79,9],[79,12,79,15]]}
[null,"Mississippi Home Corporation"]
[null,"Request for Cash"]
[]
[null,"Program:","BLIGHT ELIMINATION PROGRAM",null,null,null,null,null,null,null,null,null,"Disbursement Type:","HHF Disbursement"]
[]
[null,"Section A:  General Information",null,null,null,null,null,null,"Section B:  Project Information",null,null,null,null,null,null,null,null,null,null,"Instructions:"]
[]
[null,"  Recipient",null,{"$f":"VLOOKUP('RFC (1)'!$D$8,Factors!I4:J7,2)","v":{"$error":"#N/A"}},null,null,null,null,"Program No.",null,"Property No.",null,null,"Blight Partner No.",null,null,null,null,null,1,"Complete the Cost Items section by entering the Cost Item Category and the amount to be reimbursed."]
{"$rows_left_out":75}
{"sheet":"RFC (4)","index":3,"n_rows":82,"n_cols":64,"rows_kept":82,"cut":false,"hidden":true,"merged":[[3,2,3,6],[3,13,3,15],[5,8,5,15],[5,19,6,25],[7,10,7,12],[7,13,7,15],[7,20,8,24],[8,1,8,2],[8,3,8,6],[8,10,8,12],[11,19,12,25],[12,2,12,6],[12,13,12,15],[13,19,13,25],[18,2,18,4],[24,1,24,15],[8,13,8,15],[9,1,9,2],[9,8,9,12],[9,13,9,15],[10,13,10,15],[11,3,11,6],[11,8,11,12],[11,13,11,15],[30,2,30,8],[30,12,30,13],[34,4,34,8],[34,12,34,13],[36,1,36,15],[38,4,38,8],[38,12,38,13],[26,12,26,13],[27,2,27,8],[27,12,27,13],[27,14,27,15],[28,12,28,13],[28,14,28,15],[44,1,44,3],[44,4,44,7],[44,8,44,11],[44,12,44,15],[51,1,51,2],[53,33,53,44],[39,4,39,8],[40,4,40,8],[40,12,40,13],[41,4,41,8],[43,1,43,3],[43,4,43,7],[43,8,43,11],[43,12,43,15],[56,1,56,9],[56,12,56,15],[57,1,57,9],[57,12,57,15],[58,1,58,9],[58,12,58,15],[53,45,53,54],[53,55,53,59],[53,60,53,63],[54,1,54,9],[54,12,54,15],[55,1,55,9],[55,12,55,15],[62,1,62,9],[62,12,62,15],[63,1,63,9],[63,12,63,15],[64,1,64,9],[64,12,64,15],[59,1,59,9],[59,12,59,15],[60,1,60,9],[60,12,60,15],[61,1,61,9],[61,12,61,15],[68,1,68,9],[68,12,68,15],[69,1,69,9],[69,12,69,15],[70,1,70,9],[70,12,70,15],[65,1,65,9],[65,12,65,15],[66,1,66,9],[66,12,66,15],[67,1,67,9],[67,12,67,15],[74,1,74,9],[74,12,74,15],[75,1,75,9],[75,12,75,15],[76,1,76,9],[76,12,76,15],[71,1,71,9],[71,12,71,15],[72,1,72,9],[72,12,72,15],[73,1,73,9],[73,12,73,15],[80,12,80,15],[81,33,81,44],[81,45,81,54],[81,55,81,59],[81,60,81,63],[77,1,77,9],[77,12,77,15],[78,1,78,9],[78,12,78,15],[79,1,79,9],[79,12,79,15]]}
[null,"Mississippi Home Corporation"]
[null,"Request for Cash"]
[]
[null,"Program:","BLIGHT ELIMINATION PROGRAM",null,null,null,null,null,null,null,null,null,"Disbursement Type:","HHF Disbursement"]
[]
[null,"Section A:  General Information",null,null,null,null,null,null,"Section B:  Project Information",null,null,null,null,null,null,null,null,null,null,"Instructions:"]
[]
[null,"  Recipient",null,{"$f":"VLOOKUP('RFC (1)'!$D$8,Factors!I4:J7,2)","v":{"$error":"#N/A"}},null,null,null,null,"Program No.",null,"Property No.",null,null,"Blight Partner No.",null,null,null,null,null,1,"Complete the Cost Items section by entering the Cost Item Category and the amount to be reimbursed."]
{"$rows_left_out":75}
{"sheet":"RFC (5)","index":4,"n_rows":82,"n_cols":64,"rows_kept":82,"cut":false,"hidden":true,"merged":[[3,2,3,6],[3,13,3,15],[5,8,5,15],[5,19,6,25],[7,10,7,12],[7,13,7,15],[7,20,8,24],[8,1,8,2],[8,3,8,6],[8,10,8,12],[11,19,12,25],[12,2,12,6],[12,13,12,15],[13,19,13,25],[18,2,18,4],[24,1,24,15],[8,13,8,15],[9,1,9,2],[9,8,9,12],[9,13,9,15],[10,13,10,15],[11,3,11,6],[11,8,11,12],[11,13,11,15],[30,2,30,8],[30,12,30,13],[34,4,34,8],[34,12,34,13],[36,1,36,15],[38,4,38,8],[38,12,38,13],[26,12,26,13],[27,2,27,8],[27,12,27,13],[27,14,27,15],[28,12,28,13],[28,14,28,15],[44,1,44,3],[44,4,44,7],[44,8,44,11],[44,12,44,15],[51,1,51,2],[53,33,53,44],[39,4,39,8],[40,4,40,8],[40,12,40,13],[41,4,41,8],[43,1,43,3],[43,4,43,7],[43,8,43,11],[43,12,43,15],[56,1,56,9],[56,12,56,15],[57,1,57,9],[57,12,57,15],[58,1,58,9],[58,12,58,15],[53,45,53,54],[53,55,53,59],[53,60,53,63],[54,1,54,9],[54,12,54,15],[55,1,55,9],[55,12,55,15],[62,1,62,9],[62,12,62,15],[63,1,63,9],[63,12,63,15],[64,1,64,9],[64,12,64,15],[59,1,59,9],[59,12,59,15],[60,1,60,9],[60,12,60,15],[61,1,61,9],[61,12,61,15],[68,1,68,9],[68,12,68,15],[69,1,69,9],[69,12,69,15],[70,1,70,9],[70,12,70,15],[65,1,65,9],[65,12,65,15],[66,1,66,9],[66,12,66,15],[67,1,67,9],[67,12,67,15],[74,1,74,9],[74,12,74,15],[75,1,75,9],[75,12,75,15],[76,1,76,9],[76,12,76,15],[71,1,71,9],[71,12,71,15],[72,1,72,9],[72,12,72,15],[73,1,73,9],[73,12,73,15],[80,12,80,15],[81,33,81,44],[81,45,81,54],[81,55,81,59],[81,60,81,63],[77,1,77,9],[77,12,77,15],[78,1,78,9],[78,12,78,15],[79,1,79,9],[79,12,79,15]]}
[null,"Mississippi Home Corporation"]
[null,"Request for Cash"]
[]
[null,"Program:","BLIGHT ELIMINATION PROGRAM",null,null,null,null,null,null,null,null,null,"Disbursement Type:","HHF Disbursement"]
[]
[null,"Section A:  General Information",null,null,null,null,null,null,"Section B:  Project Information",null,null,null,null,null,null,null,null,null,null,"Instructions:"]
[]
[null,"  Recipient",null,{"$f":"VLOOKUP('RFC (1)'!$D$8,Factors!I4:J7,2)","v":{"$error":"#N/A"}},null,null,null,null,"Program No.",null,"Property No.",null,null,"Blight Partner No.",null,null,null,null,null,1,"Complete the Cost Items section by entering the Cost Item Category and the amount to be reimbursed."]
{"$rows_left_out":75}
{"sheet":"RFC (6)","index":5,"n_rows":82,"n_cols":64,"rows_kept":82,"cut":false,"hidden":true,"merged":[[3,2,3,6],[3,13,3,15],[5,8,5,15],[5,19,6,25],[7,10,7,12],[7,13,7,15],[7,20,8,24],[8,1,8,2],[8,3,8,6],[8,10,8,12],[11,19,12,25],[12,2,12,6],[12,13,12,15],[13,19,13,25],[18,2,18,4],[24,1,24,15],[8,13,8,15],[9,1,9,2],[9,8,9,12],[9,13,9,15],[10,13,10,15],[11,3,11,6],[11,8,11,12],[11,13,11,15],[30,2,30,8],[30,12,30,13],[34,4,34,8],[34,12,34,13],[36,1,36,15],[38,4,38,8],[38,12,38,13],[26,12,26,13],[27,2,27,8],[27,12,27,13],[27,14,27,15],[28,12,28,13],[28,14,28,15],[44,1,44,3],[44,4,44,7],[44,8,44,11],[44,12,44,15],[51,1,51,2],[53,33,53,44],[39,4,39,8],[40,4,40,8],[40,12,40,13],[41,4,41,8],[43,1,43,3],[43,4,43,7],[43,8,43,11],[43,12,43,15],[56,1,56,9],[56,12,56,15],[57,1,57,9],[57,12,57,15],[58,1,58,9],[58,12,58,15],[53,45,53,54],[53,55,53,59],[53,60,53,63],[54,1,54,9],[54,12,54,15],[55,1,55,9],[55,12,55,15],[62,1,62,9],[62,12,62,15],[63,1,63,9],[63,12,63,15],[64,1,64,9],[64,12,64,15],[59,1,59,9],[59,12,59,15],[60,1,60,9],[60,12,60,15],[61,1,61,9],[61,12,61,15],[68,1,68,9],[68,12,68,15],[69,1,69,9],[69,12,69,15],[70,1,70,9],[70,12,70,15],[65,1,65,9],[65,12,65,15],[66,1,66,9],[66,12,66,15],[67,1,67,9],[67,12,67,15],[74,1,74,9],[74,12,74,15],[75,1,75,9],[75,12,75,15],[76,1,76,9],[76,12,76,15],[71,1,71,9],[71,12,71,15],[72,1,72,9],[72,12,72,15],[73,1,73,9],[73,12,73,15],[80,12,80,15],[81,33,81,44],[81,45,81,54],[81,55,81,59],[81,60,81,63],[77,1,77,9],[77,12,77,15],[78,1,78,9],[78,12,78,15],[79,1,79,9],[79,12,79,15]]}
[null,"Mississippi Home Corporation"]
[null,"Request for Cash"]
[]
[null,"Program:","BLIGHT ELIMINATION PROGRAM",null,null,null,null,null,null,null,null,null,"Disbursement Type:","HHF Disbursement"]
[]
[null,"Section A:  General Information",null,null,null,null,null,null,"Section B:  Project Information",null,null,null,null,null,null,null,null,null,null,"Instructions:"]
[]
[null,"  Recipient",null,{"$f":"VLOOKUP('RFC (1)'!$D$8,Factors!I4:J7,2)","v":{"$error":"#N/A"}},null,null,null,null,"Program No.",null,"Property No.",null,null,"Blight Partner No.",null,null,null,null,null,1,"Complete the Cost Items section by entering the Cost Item Category and the amount to be reimbursed."]
{"$rows_left_out":75}
{"sheet":"RFC (7)","index":6,"n_rows":82,"n_cols":64,"rows_kept":82,"cut":false,"hidden":true,"merged":[[3,2,3,6],[3,13,3,15],[5,8,5,15],[5,19,6,25],[7,10,7,12],[7,13,7,15],[7,20,8,24],[8,1,8,2],[8,3,8,6],[8,10,8,12],[11,19,12,25],[12,2,12,6],[12,13,12,15],[13,19,13,25],[18,2,18,4],[24,1,24,15],[8,13,8,15],[9,1,9,2],[9,8,9,12],[9,13,9,15],[10,13,10,15],[11,3,11,6],[11,8,11,12],[11,13,11,15],[30,2,30,8],[30,12,30,13],[34,4,34,8],[34,12,34,13],[36,1,36,15],[38,4,38,8],[38,12,38,13],[26,12,26,13],[27,2,27,8],[27,12,27,13],[27,14,27,15],[28,12,28,13],[28,14,28,15],[44,1,44,3],[44,4,44,7],[44,8,44,11],[44,12,44,15],[51,1,51,2],[53,33,53,44],[39,4,39,8],[40,4,40,8],[40,12,40,13],[41,4,41,8],[43,1,43,3],[43,4,43,7],[43,8,43,11],[43,12,43,15],[56,1,56,9],[56,12,56,15],[57,1,57,9],[57,12,57,15],[58,1,58,9],[58,12,58,15],[53,45,53,54],[53,55,53,59],[53,60,53,63],[54,1,54,9],[54,12,54,15],[55,1,55,9],[55,12,55,15],[62,1,62,9],[62,12,62,15],[63,1,63,9],[63,12,63,15],[64,1,64,9],[64,12,64,15],[59,1,59,9],[59,12,59,15],[60,1,60,9],[60,12,60,15],[61,1,61,9],[61,12,61,15],[68,1,68,9],[68,12,68,15],[69,1,69,9],[69,12,69,15],[70,1,70,9],[70,12,70,15],[65,1,65,9],[65,12,65,15],[66,1,66,9],[66,12,66,15],[67,1,67,9],[67,12,67,15],[74,1,74,9],[74,12,74,15],[75,1,75,9],[75,12,75,15],[76,1,76,9],[76,12,76,15],[71,1,71,9],[71,12,71,15],[72,1,72,9],[72,12,72,15],[73,1,73,9],[73,12,73,15],[80,12,80,15],[81,33,81,44],[81,45,81,54],[81,55,81,59],[81,60,81,63],[77,1,77,9],[77,12,77,15],[78,1,78,9],[78,12,78,15],[79,1,79,9],[79,12,79,15]]}
[null,"Mississippi Home Corporation"]
[null,"Request for Cash"]
[]
[null,"Program:","BLIGHT ELIMINATION PROGRAM",null,null,null,null,null,null,null,null,null,"Disbursement Type:","HHF Disbursement"]
[]
[null,"Section A:  General Information",null,null,null,null,null,null,"Section B:  Project Information",null,null,null,null,null,null,null,null,null,null,"Instructions:"]
[]
[null,"  Recipient",null,{"$f":"VLOOKUP('RFC (1)'!$D$8,Factors!I4:J7,2)","v":{"$error":"#N/A"}},null,null,null,null,"Program No.",null,"Property No.",null,null,"Blight Partner No.",null,null,null,null,null,1,"Complete the Cost Items section by entering the Cost Item Category and the amount to be reimbursed."]
{"$rows_left_out":75}
{"sheet":"RFC (8)","index":7,"n_rows":82,"n_cols":64,"rows_kept":82,"cut":false,"hidden":true,"merged":[[3,2,3,6],[3,13,3,15],[5,8,5,15],[5,19,6,25],[7,10,7,12],[7,13,7,15],[7,20,8,24],[8,1,8,2],[8,3,8,6],[8,10,8,12],[11,19,12,25],[12,2,12,6],[12,13,12,15],[13,19,13,25],[18,2,18,4],[24,1,24,15],[8,13,8,15],[9,1,9,2],[9,8,9,12],[9,13,9,15],[10,13,10,15],[11,3,11,6],[11,8,11,12],[11,13,11,15],[30,2,30,8],[30,12,30,13],[34,4,34,8],[34,12,34,13],[36,1,36,15],[38,4,38,8],[38,12,38,13],[26,12,26,13],[27,2,27,8],[27,12,27,13],[27,14,27,15],[28,12,28,13],[28,14,28,15],[44,1,44,3],[44,4,44,7],[44,8,44,11],[44,12,44,15],[51,1,51,2],[53,33,53,44],[39,4,39,8],[40,4,40,8],[40,12,40,13],[41,4,41,8],[43,1,43,3],[43,4,43,7],[43,8,43,11],[43,12,43,15],[56,1,56,9],[56,12,56,15],[57,1,57,9],[57,12,57,15],[58,1,58,9],[58,12,58,15],[53,45,53,54],[53,55,53,59],[53,60,53,63],[54,1,54,9],[54,12,54,15],[55,1,55,9],[55,12,55,15],[62,1,62,9],[62,12,62,15],[63,1,63,9],[63,12,63,15],[64,1,64,9],[64,12,64,15],[59,1,59,9],[59,12,59,15],[60,1,60,9],[60,12,60,15],[61,1,61,9],[61,12,61,15],[68,1,68,9],[68,12,68,15],[69,1,69,9],[69,12,69,15],[70,1,70,9],[70,12,70,15],[65,1,65,9],[65,12,65,15],[66,1,66,9],[66,12,66,15],[67,1,67,9],[67,12,67,15],[74,1,74,9],[74,12,74,15],[75,1,75,9],[75,12,75,15],[76,1,76,9],[76,12,76,15],[71,1,71,9],[71,12,71,15],[72,1,72,9],[72,12,72,15],[73,1,73,9],[73,12,73,15],[80,12,80,15],[81,33,81,44],[81,45,81,54],[81,55,81,59],[81,60,81,63],[77,1,77,9],[77,12,77,15],[78,1,78,9],[78,12,78,15],[79,1,79,9],[79,12,79,15]]}
[null,"Mississippi Home Corporation"]
[null,"Request for Cash"]
[]
[null,"Program:","BLIGHT ELIMINATION PROGRAM",null,null,null,null,null,null,null,null,null,"Disbursement Type:","HHF Disbursement"]
[]
[null,"Section A:  General Information",null,null,null,null,null,null,"Section B:  Project Information",null,null,null,null,null,null,null,null,null,null,"Instructions:"]
[]
[null,"  Recipient",null,{"$f":"VLOOKUP('RFC (1)'!$D$8,Factors!I4:J7,2)","v":{"$error":"#N/A"}},null,null,null,null,"Program No.",null,"Property No.",null,null,"Blight Partner No.",null,null,null,null,null,1,"Complete the Cost Items section by entering the Cost Item Category and the amount to be reimbursed."]
{"$rows_left_out":75}
{"sheet":"RFC (9)","index":8,"n_rows":82,"n_cols":64,"rows_kept":82,"cut":false,"hidden":true,"merged":[[3,2,3,6],[3,13,3,15],[5,8,5,15],[5,19,6,25],[7,10,7,12],[7,13,7,15],[7,20,8,24],[8,1,8,2],[8,3,8,6],[8,10,8,12],[11,19,12,25],[12,2,12,6],[12,13,12,15],[13,19,13,25],[18,2,18,4],[24,1,24,15],[8,13,8,15],[9,1,9,2],[9,8,9,12],[9,13,9,15],[10,13,10,15],[11,3,11,6],[11,8,11,12],[11,13,11,15],[30,2,30,8],[30,12,30,13],[34,4,34,8],[34,12,34,13],[36,1,36,15],[38,4,38,8],[38,12,38,13],[26,12,26,13],[27,2,27,8],[27,12,27,13],[27,14,27,15],[28,12,28,13],[28,14,28,15],[44,1,44,3],[44,4,44,7],[44,8,44,11],[44,12,44,15],[51,1,51,2],[53,33,53,44],[39,4,39,8],[40,4,40,8],[40,12,40,13],[41,4,41,8],[43,1,43,3],[43,4,43,7],[43,8,43,11],[43,12,43,15],[56,1,56,9],[56,12,56,15],[57,1,57,9],[57,12,57,15],[58,1,58,9],[58,12,58,15],[53,45,53,54],[53,55,53,59],[53,60,53,63],[54,1,54,9],[54,12,54,15],[55,1,55,9],[55,12,55,15],[62,1,62,9],[62,12,62,15],[63,1,63,9],[63,12,63,15],[64,1,64,9],[64,12,64,15],[59,1,59,9],[59,12,59,15],[60,1,60,9],[60,12,60,15],[61,1,61,9],[61,12,61,15],[68,1,68,9],[68,12,68,15],[69,1,69,9],[69,12,69,15],[70,1,70,9],[70,12,70,15],[65,1,65,9],[65,12,65,15],[66,1,66,9],[66,12,66,15],[67,1,67,9],[67,12,67,15],[74,1,74,9],[74,12,74,15],[75,1,75,9],[75,12,75,15],[76,1,76,9],[76,12,76,15],[71,1,71,9],[71,12,71,15],[72,1,72,9],[72,12,72,15],[73,1,73,9],[73,12,73,15],[80,12,80,15],[81,33,81,44],[81,45,81,54],[81,55,81,59],[81,60,81,63],[77,1,77,9],[77,12,77,15],[78,1,78,9],[78,12,78,15],[79,1,79,9],[79,12,79,15]]}
[null,"Mississippi Home Corporation"]
[null,"Request for Cash"]
[]
[null,"Program:","BLIGHT ELIMINATION PROGRAM",null,null,null,null,null,null,null,null,null,"Disbursement Type:","HHF Disbursement"]
[]
[null,"Section A:  General Information",null,null,null,null,null,null,"Section B:  Project Information",null,null,null,null,null,null,null,null,null,null,"Instructions:"]
[]
[null,"  Recipient",null,{"$f":"VLOOKUP('RFC (1)'!$D$8,Factors!I4:J7,2)","v":{"$error":"#N/A"}},null,null,null,null,"Program No.",null,"Property No.",null,null,"Blight Partner No.",null,null,null,null,null,1,"Complete the Cost Items section by entering the Cost Item Category and the amount to be reimbursed."]
{"$rows_left_out":75}
{"sheet":"RFC (10)","index":9,"n_rows":82,"n_cols":64,"rows_kept":82,"cut":false,"hidden":true,"merged":[[3,2,3,6],[3,13,3,15],[5,8,5,15],[5,19,6,25],[7,10,7,12],[7,13,7,15],[7,20,8,24],[8,1,8,2],[8,3,8,6],[8,10,8,12],[12,2,12,6],[12,13,12,15],[13,19,13,25],[18,2,18,4],[24,1,24,15],[8,13,8,15],[9,1,9,2],[9,8,9,12],[9,13,9,15],[10,13,10,15],[11,3,11,6],[11,8,11,12],[11,13,11,15],[30,2,30,8],[30,12,30,13],[34,4,34,8],[34,12,34,13],[36,1,36,15],[38,4,38,8],[38,12,38,13],[26,12,26,13],[27,2,27,8],[27,12,27,13],[27,14,27,15],[28,12,28,13],[28,14,28,15],[44,1,44,3],[44,4,44,7],[44,8,44,11],[44,12,44,15],[51,1,51,2],[53,33,53,44],[39,4,39,8],[40,4,40,8],[40,12,40,13],[41,4,41,8],[43,1,43,3],[43,4,43,7],[43,8,43,11],[43,12,43,15],[56,1,56,9],[56,12,56,15],[57,1,57,9],[57,12,57,15],[58,1,58,9],[58,12,58,15],[53,45,53,54],[53,55,53,59],[53,60,53,63],[54,1,54,9],[54,12,54,15],[55,1,55,9],[55,12,55,15],[62,1,62,9],[62,12,62,15],[63,1,63,9],[63,12,63,15],[64,1,64,9],[64,12,64,15],[59,1,59,9],[59,12,59,15],[60,1,60,9],[60,12,60,15],[61,1,61,9],[61,12,61,15],[68,1,68,9],[68,12,68,15],[69,1,69,9],[69,12,69,15],[70,1,70,9],[70,12,70,15],[65,1,65,9],[65,12,65,15],[66,1,66,9],[66,12,66,15],[67,1,67,9],[67,12,67,15],[74,1,74,9],[74,12,74,15],[75,1,75,9],[75,12,75,15],[76,1,76,9],[76,12,76,15],[71,1,71,9],[71,12,71,15],[72,1,72,9],[72,12,72,15],[73,1,73,9],[73,12,73,15],[80,12,80,15],[81,33,81,44],[81,45,81,54],[81,55,81,59],[81,60,81,63],[77,1,77,9],[77,12,77,15],[78,1,78,9],[78,12,78,15],[79,1,79,9],[79,12,79,15]]}
[null,"Mississippi Home Corporation"]
[null,"Request for Cash"]
[]
[null,"Program:","BLIGHT ELIMINATION PROGRAM",null,null,null,null,null,null,null,null,null,"Disbursement Type:","HHF Disbursement"]
[]
[null,"Section A:  General Information",null,null,null,null,null,null,"Section B:  Project Information",null,null,null,null,null,null,null,null,null,null,"Instructions:"]
[]
[null,"  Recipient",null,{"$f":"VLOOKUP('RFC (1)'!$D$8,Factors!I4:J7,2)","v":{"$error":"#N/A"}},null,null,null,null,"Program No.",null,"Property No.",null,null,"Blight Partner No.",null,null,null,null,null,1,"Complete the Cost Items section by entering the Cost Item Category and the amount to be reimbursed."]
{"$rows_left_out":75}
{"sheet":"Factors","index":10,"n_rows":34,"n_cols":17,"rows_kept":34,"cut":false,"hidden":true,"merged":[]}
[null,null,"budget_items",null,null,null,null,null,"app_info"]
[]
[null,null,"1-Acquisition Costs",null,null,null,null,null,null,"ApplicantName","AppAddress","AppCity","AppState","AppZip","AppPhone","ProgramNo","AppStatus"]
[null,null,"2-Payoff Back Taxes",null,null,null,null,null,1,"City of Columbus","1621 Main Street","Columbus","MS","39701",6623287021,"BEP-002","Application Approved"]
[null,null,"3-Pre-demolition title work",null,null,null,null,null,2,"City of Vicksburg","1401 Walnut Street","Vicksburg","MS","39180","(601) 634-4528","BEP-004","Application Approved"]
[null,null,"4-Appraisal Fee",null,null,null,null,null,3,"City of Shaw","101 Faison Street","Shaw","MS","38773",6627543131,"BEP-005","Application Approved"]
[null,null,"5-Survey",null,null,null,null,null,4,"City of Jackson","P.O. Box 17","Jackson","MS","39205",6019601084,"BEP-006","Application Approved"]
[null,null,"6-Legal Fees to clear title"]
{"$rows_left_out":26}